{"text_format":"1","workbook":"xlsx","n_sheets":3,"sheets":["Start","Risikovurdering","Matrise"],"not_rendered":{"charts":0,"images":0,"macros":1,"external_links":0,"defined_names":1,"comments":0,"pivot_tables":0},"unopened":[],"bounds":{"document_bytes":16777216,"sheet_cells":100000,"rows_first":2000,"rows_last":500,"rows_between":2000,"halvings":0,"cell_chars":16384,"cell_head_chars":4096},"cells_cut":0,"cells_raw":0,"read":"whole","date_system":"1900"}

{"sheet":"Start","index":0,"n_rows":21,"n_cols":9,"rows_kept":21,"cut":false,"hidden":false,"merged":[]}
["Oppdatert i versjon 2.0 av Internkontroll i praksis - informasjonssikkerhet. Utarbeidet av Digitaliseringsdirektoratet."]
[]
[null,null,null,1,2,3,4]
[null,{"$f":"D21","v":"Svært høy"},4,"Moderat","Høy","Høy","Svært høy"]
[null,{"$f":"D20","v":"Høy"},3,"Moderat","Moderat","Høy","Høy"]
[null,{"$f":"D19","v":"Moderat"},2,"Lav","Moderat","Moderat","Høy"]
[null,{"$f":"D18","v":"Lav"},1,"Lav","Lav","Moderat","Moderat"]
[null,null,null,{"$f":"F18","v":"Lav"},{"$f":"F19","v":"Moderat"},{"$f":"F20","v":"Høy"},{"$f":"F21","v":"Svært høy"}]
[]
[]
[]
[]
[]
[]
[]
[null,null,null,"SANNSYNLIGHET",null,"KONSEKVENS",null,"RISIKO"]
[]
[null,null,null,"Lav",1,"Lav",1,"Lav",1]
[null,null,null,"Moderat",2,"Moderat",2,"Moderat",2]
[null,null,null,"Høy",3,"Høy",3,"Høy",3]
[null,null,null,"Svært høy",4,"Svært høy",4,"Svært høy",4]

{"sheet":"Risikovurdering","index":1,"n_rows":102,"n_cols":18,"rows_kept":102,"cut":false,"hidden":true,"merged":[]}
[]
["ID","NR","Sanns_verdi","Kons_verdi","Risiko_verdi","Sanns_etter_verdi","Kons_etter_verdi","Gj_Risiko_verdi","Risikobeskrivelse\nStikkord om:\n(1) innledende hendelse(r)\n(2) informasjonssikkerhetsbruddet\n(3) de uønskede konsekvensene som kan oppstå","Begrunnelse for konsekvensvurdering","Konsekvens","Tilhørende sannsynlighet","Begrunnelse for vurdering av tilhørende sannsynlighet","Risikonivå","Vurdering av risikohåndtering","Konsekvens etter tiltak","Sannsynlighet etter tiltak","Gjenværende risiko"]
[{"$f":"\"R\"&B3","v":"R1"},1,{"$f":"IFERROR(VLOOKUP(L3,Start!$D$18:$E$21,2,FALSE),0)","v":4},{"$f":"IFERROR(VLOOKUP(K3,Start!$F$18:$G$21,2,FALSE),0)","v":3},{"$f":"IFERROR(VLOOKUP(N3,Start!$H$18:$I$21,2,FALSE),0)","v":3},{"$f":"IFERROR(VLOOKUP(Q3,Start!$D$18:$E$21,2,FALSE),0)","v":2},{"$f":"IFERROR(VLOOKUP(P3,Start!$F$18:$G$21,2,FALSE),0)","v":2},{"$f":"IFERROR(VLOOKUP(R3,Start!$H$18:$I$21,2,FALSE),0)","v":2},"Risiko 1",null,"Høy","Svært høy",null,{"$f":"VLOOKUP(C3,Start!$C$4:$G$7,MATCH(D3,Start!$D$3:$G$3,0)+1,FALSE)","v":"Høy"},null,"Moderat","Moderat",{"$f":"VLOOKUP(F3,Start!$C$4:$G$7,MATCH(G3,Start!$D$3:$G$3,0)+1,FALSE)","v":"Moderat"}]
[{"$f":"\"R\"&B4","v":"R2"},2,{"$f":"IFERROR(VLOOKUP(L4,Start!$D$18:$E$21,2,FALSE),0)","v":0},{"$f":"IFERROR(VLOOKUP(K4,Start!$F$18:$G$21,2,FALSE),0)","v":0},{"$f":"IFERROR(VLOOKUP(N4,Start!$H$18:$I$21,2,FALSE),0)","v":0},{"$f":"IFERROR(VLOOKUP(Q4,Start!$D$18:$E$21,2,FALSE),0)","v":0},{"$f":"IFERROR(VLOOKUP(P4,Start!$F$18:$G$21,2,FALSE),0)","v":0},{"$f":"IFERROR(VLOOKUP(R4,Start!$H$18:$I$21,2,FALSE),0)","v":0},"Risiko 2",null,null,null,null,{"$f":"VLOOKUP(C4,Start!$C$4:$G$7,MATCH(D4,Start!$D$3:$G$3,0)+1,FALSE)","v":{"$error":"#N/A"}},null,null,null,{"$f":"VLOOKUP(F4,Start!$C$4:$G$7,MATCH(G4,Start!$D$3:$G$3,0)+1,FALSE)","v":{"$error":"#N/A"}}]
[{"$f":"\"R\"&B5","v":"R3"},3,{"$f":"IFERROR(VLOOKUP(L5,Start!$D$18:$E$21,2,FALSE),0)","v":0},{"$f":"IFERROR(VLOOKUP(K5,Start!$F$18:$G$21,2,FALSE),0)","v":0},{"$f":"IFERROR(VLOOKUP(N5,Start!$H$18:$I$21,2,FALSE),0)","v":0},{"$f":"IFERROR(VLOOKUP(Q5,Start!$D$18:$E$21,2,FALSE),0)","v":0},{"$f":"IFERROR(VLOOKUP(P5,Start!$F$18:$G$21,2,FALSE),0)","v":0},{"$f":"IFERROR(VLOOKUP(R5,Start!$H$18:$I$21,2,FALSE),0)","v":0},"Risiko 3",null,null,null,null,{"$f":"VLOOKUP(C5,Start!$C$4:$G$7,MATCH(D5,Start!$D$3:$G$3,0)+1,FALSE)","v":{"$error":"#N/A"}},null,null,null,{"$f":"VLOOKUP(F5,Start!$C$4:$G$7,MATCH(G5,Start!$D$3:$G$3,0)+1,FALSE)","v":{"$error":"#N/A"}}]
[{"$f":"\"R\"&B6","v":"R4"},4,{"$f":"IFERROR(VLOOKUP(L6,Start!$D$18:$E$21,2,FALSE),0)","v":0},{"$f":"IFERROR(VLOOKUP(K6,Start!$F$18:$G$21,2,FALSE),0)","v":0},{"$f":"IFERROR(VLOOKUP(N6,Start!$H$18:$I$21,2,FALSE),0)","v":0},{"$f":"IFERROR(VLOOKUP(Q6,Start!$D$18:$E$21,2,FALSE),0)","v":0},{"$f":"IFERROR(VLOOKUP(P6,Start!$F$18:$G$21,2,FALSE),0)","v":0},{"$f":"IFERROR(VLOOKUP(R6,Start!$H$18:$I$21,2,FALSE),0)","v":0},"Risiko 4",null,null,null,null,{"$f":"VLOOKUP(C6,Start!$C$4:$G$7,MATCH(D6,Start!$D$3:$G$3,0)+1,FALSE)","v":{"$error":"#N/A"}},null,null,null,{"$f":"VLOOKUP(F6,Start!$C$4:$G$7,MATCH(G6,Start!$D$3:$G$3,0)+1,FALSE)","v":{"$error":"#N/A"}}]
[{"$f":"\"R\"&B7","v":"R5"},5,{"$f":"IFERROR(VLOOKUP(L7,Start!$D$18:$E$21,2,FALSE),0)","v":0},{"$f":"IFERROR(VLOOKUP(K7,Start!$F$18:$G$21,2,FALSE),0)","v":0},{"$f":"IFERROR(VLOOKUP(N7,Start!$H$18:$I$21,2,FALSE),0)","v":0},{"$f":"IFERROR(VLOOKUP(Q7,Start!$D$18:$E$21,2,FALSE),0)","v":0},{"$f":"IFERROR(VLOOKUP(P7,Start!$F$18:$G$21,2,FALSE),0)","v":0},{"$f":"IFERROR(VLOOKUP(R7,Start!$H$18:$I$21,2,FALSE),0)","v":0},"Risiko 5",null,null,null,null,{"$f":"VLOOKUP(C7,Start!$C$4:$G$7,MATCH(D7,Start!$D$3:$G$3,0)+1,FALSE)","v":{"$error":"#N/A"}},null,null,null,{"$f":"VLOOKUP(F7,Start!$C$4:$G$7,MATCH(G7,Start!$D$3:$G$3,0)+1,FALSE)","v":{"$error":"#N/A"}}]
[{"$f":"\"R\"&B8","v":"R6"},6,{"$f":"IFERROR(VLOOKUP(L8,Start!$D$18:$E$21,2,FALSE),0)","v":0},{"$f":"IFERROR(VLOOKUP(K8,Start!$F$18:$G$21,2,FALSE),0)","v":0},{"$f":"IFERROR(VLOOKUP(N8,Start!$H$18:$I$21,2,FALSE),0)","v":0},{"$f":"IFERROR(VLOOKUP(Q8,Start!$D$18:$E$21,2,FALSE),0)","v":0},{"$f":"IFERROR(VLOOKUP(P8,Start!$F$18:$G$21,2,FALSE),0)","v":0},{"$f":"IFERROR(VLOOKUP(R8,Start!$H$18:$I$21,2,FALSE),0)","v":0},"Risiko 6",null,null,null,null,{"$f":"VLOOKUP(C8,Start!$C$4:$G$7,MATCH(D8,Start!$D$3:$G$3,0)+1,FALSE)","v":{"$error":"#N/A"}},null,null,null,{"$f":"VLOOKUP(F8,Start!$C$4:$G$7,MATCH(G8,Start!$D$3:$G$3,0)+1,FALSE)","v":{"$error":"#N/A"}}]
[{"$f":"\"R\"&B9","v":"R7"},7,{"$f":"IFERROR(VLOOKUP(L9,Start!$D$18:$E$21,2,FALSE),0)","v":0},{"$f":"IFERROR(VLOOKUP(K9,Start!$F$18:$G$21,2,FALSE),0)","v":0},{"$f":"IFERROR(VLOOKUP(N9,Start!$H$18:$I$21,2,FALSE),0)","v":0},{"$f":"IFERROR(VLOOKUP(Q9,Start!$D$18:$E$21,2,FALSE),0)","v":0},{"$f":"IFERROR(VLOOKUP(P9,Start!$F$18:$G$21,2,FALSE),0)","v":0},{"$f":"IFERROR(VLOOKUP(R9,Start!$H$18:$I$21,2,FALSE),0)","v":0},"Risiko 7",null,null,null,null,{"$f":"VLOOKUP(C9,Start!$C$4:$G$7,MATCH(D9,Start!$D$3:$G$3,0)+1,FALSE)","v":{"$error":"#N/A"}},null,null,null,{"$f":"VLOOKUP(F9,Start!$C$4:$G$7,MATCH(G9,Start!$D$3:$G$3,0)+1,FALSE)","v":{"$error":"#N/A"}}]
[{"$f":"\"R\"&B10","v":"R8"},8,{"$f":"IFERROR(VLOOKUP(L10,Start!$D$18:$E$21,2,FALSE),0)","v":0},{"$f":"IFERROR(VLOOKUP(K10,Start!$F$18:$G$21,2,FALSE),0)","v":0},{"$f":"IFERROR(VLOOKUP(N10,Start!$H$18:$I$21,2,FALSE),0)","v":0},{"$f":"IFERROR(VLOOKUP(Q10,Start!$D$18:$E$21,2,FALSE),0)","v":0},{"$f":"IFERROR(VLOOKUP(P10,Start!$F$18:$G$21,2,FALSE),0)","v":0},{"$f":"IFERROR(VLOOKUP(R10,Start!$H$18:$I$21,2,FALSE),0)","v":0},"Risiko 8",null,null,null,null,{"$f":"VLOOKUP(C10,Start!$C$4:$G$7,MATCH(D10,Start!$D$3:$G$3,0)+1,FALSE)","v":{"$error":"#N/A"}},null,null,null,{"$f":"VLOOKUP(F10,Start!$C$4:$G$7,MATCH(G10,Start!$D$3:$G$3,0)+1,FALSE)","v":{"$error":"#N/A"}}]
[{"$f":"\"R\"&B11","v":"R9"},9,{"$f":"IFERROR(VLOOKUP(L11,Start!$D$18:$E$21,2,FALSE),0)","v":0},{"$f":"IFERROR(VLOOKUP(K11,Start!$F$18:$G$21,2,FALSE),0)","v":0},{"$f":"IFERROR(VLOOKUP(N11,Start!$H$18:$I$21,2,FALSE),0)","v":0},{"$f":"IFERROR(VLOOKUP(Q11,Start!$D$18:$E$21,2,FALSE),0)","v":0},{"$f":"IFERROR(VLOOKUP(P11,Start!$F$18:$G$21,2,FALSE),0)","v":0},{"$f":"IFERROR(VLOOKUP(R11,Start!$H$18:$I$21,2,FALSE),0)","v":0},"Risiko 9",null,null,null,null,{"$f":"VLOOKUP(C11,Start!$C$4:$G$7,MATCH(D11,Start!$D$3:$G$3,0)+1,FALSE)","v":{"$error":"#N/A"}},null,null,null,{"$f":"VLOOKUP(F11,Start!$C$4:$G$7,MATCH(G11,Start!$D$3:$G$3,0)+1,FALSE)","v":{"$error":"#N/A"}}]
[{"$f":"\"R\"&B12","v":"R10"},10,{"$f":"IFERROR(VLOOKUP(L12,Start!$D$18:$E$21,2,FALSE),0)","v":0},{"$f":"IFERROR(VLOOKUP(K12,Start!$F$18:$G$21,2,FALSE),0)","v":0},{"$f":"IFERROR(VLOOKUP(N12,Start!$H$18:$I$21,2,FALSE),0)","v":0},{"$f":"IFERROR(VLOOKUP(Q12,Start!$D$18:$E$21,2,FALSE),0)","v":0},{"$f":"IFERROR(VLOOKUP(P12,Start!$F$18:$G$21,2,FALSE),0)","v":0},{"$f":"IFERROR(VLOOKUP(R12,Start!$H$18:$I$21,2,FALSE),0)","v":0},"Risiko 10",null,null,null,null,{"$f":"VLOOKUP(C12,Start!$C$4:$G$7,MATCH(D12,Start!$D$3:$G$3,0)+1,FALSE)","v":{"$error":"#N/A"}},null,null,null,{"$f":"VLOOKUP(F12,Start!$C$4:$G$7,MATCH(G12,Start!$D$3:$G$3,0)+1,FALSE)","v":{"$error":"#N/A"}}]
[{"$f":"\"R\"&B13","v":"R11"},11,{"$f":"IFERROR(VLOOKUP(L13,Start!$D$18:$E$21,2,FALSE),0)","v":0},{"$f":"IFERROR(VLOOKUP(K13,Start!$F$18:$G$21,2,FALSE),0)","v":0},{"$f":"IFERROR(VLOOKUP(N13,Start!$H$18:$I$21,2,FALSE),0)","v":0},{"$f":"IFERROR(VLOOKUP(Q13,Start!$D$18:$E$21,2,FALSE),0)","v":0},{"$f":"IFERROR(VLOOKUP(P13,Start!$F$18:$G$21,2,FALSE),0)","v":0},{"$f":"IFERROR(VLOOKUP(R13,Start!$H$18:$I$21,2,FALSE),0)","v":0},null,null,null,null,null,{"$f":"VLOOKUP(C13,Start!$C$4:$G$7,MATCH(D13,Start!$D$3:$G$3,0)+1,FALSE)","v":{"$error":"#N/A"}},null,null,null,{"$f":"VLOOKUP(F13,Start!$C$4:$G$7,MATCH(G13,Start!$D$3:$G$3,0)+1,FALSE)","v":{"$error":"#N/A"}}]
[{"$f":"\"R\"&B14","v":"R12"},12,{"$f":"IFERROR(VLOOKUP(L14,Start!$D$18:$E$21,2,FALSE),0)","v":0},{"$f":"IFERROR(VLOOKUP(K14,Start!$F$18:$G$21,2,FALSE),0)","v":0},{"$f":"IFERROR(VLOOKUP(N14,Start!$H$18:$I$21,2,FALSE),0)","v":0},{"$f":"IFERROR(VLOOKUP(Q14,Start!$D$18:$E$21,2,FALSE),0)","v":0},{"$f":"IFERROR(VLOOKUP(P14,Start!$F$18:$G$21,2,FALSE),0)","v":0},{"$f":"IFERROR(VLOOKUP(R14,Start!$H$18:$I$21,2,FALSE),0)","v":0},null,null,null,null,null,{"$f":"VLOOKUP(C14,Start!$C$4:$G$7,MATCH(D14,Start!$D$3:$G$3,0)+1,FALSE)","v":{"$error":"#N/A"}},null,null,null,{"$f":"VLOOKUP(F14,Start!$C$4:$G$7,MATCH(G14,Start!$D$3:$G$3,0)+1,FALSE)","v":{"$error":"#N/A"}}]
[{"$f":"\"R\"&B15","v":"R13"},13,{"$f":"IFERROR(VLOOKUP(L15,Start!$D$18:$E$21,2,FALSE),0)","v":0},{"$f":"IFERROR(VLOOKUP(K15,Start!$F$18:$G$21,2,FALSE),0)","v":0},{"$f":"IFERROR(VLOOKUP(N15,Start!$H$18:$I$21,2,FALSE),0)","v":0},{"$f":"IFERROR(VLOOKUP(Q15,Start!$D$18:$E$21,2,FALSE),0)","v":0},{"$f":"IFERROR(VLOOKUP(P15,Start!$F$18:$G$21,2,FALSE),0)","v":0},{"$f":"IFERROR(VLOOKUP(R15,Start!$H$18:$I$21,2,FALSE),0)","v":0},null,null,null,null,null,{"$f":"VLOOKUP(C15,Start!$C$4:$G$7,MATCH(D15,Start!$D$3:$G$3,0)+1,FALSE)","v":{"$error":"#N/A"}},null,null,null,{"$f":"VLOOKUP(F15,Start!$C$4:$G$7,MATCH(G15,Start!$D$3:$G$3,0)+1,FALSE)","v":{"$error":"#N/A"}}]
[{"$f":"\"R\"&B16","v":"R14"},14,{"$f":"IFERROR(VLOOKUP(L16,Start!$D$18:$E$21,2,FALSE),0)","v":0},{"$f":"IFERROR(VLOOKUP(K16,Start!$F$18:$G$21,2,FALSE),0)","v":0},{"$f":"IFERROR(VLOOKUP(N16,Start!$H$18:$I$21,2,FALSE),0)","v":0},{"$f":"IFERROR(VLOOKUP(Q16,Start!$D$18:$E$21,2,FALSE),0)","v":0},{"$f":"IFERROR(VLOOKUP(P16,Start!$F$18:$G$21,2,FALSE),0)","v":0},{"$f":"IFERROR(VLOOKUP(R16,Start!$H$18:$I$21,2,FALSE),0)","v":0},null,null,null,null,null,{"$f":"VLOOKUP(C16,Start!$C$4:$G$7,MATCH(D16,Start!$D$3:$G$3,0)+1,FALSE)","v":{"$error":"#N/A"}},null,null,null,{"$f":"VLOOKUP(F16,Start!$C$4:$G$7,MATCH(G16,Start!$D$3:$G$3,0)+1,FALSE)","v":{"$error":"#N/A"}}]
[{"$f":"\"R\"&B17","v":"R15"},15,{"$f":"IFERROR(VLOOKUP(L17,Start!$D$18:$E$21,2,FALSE),0)","v":0},{"$f":"IFERROR(VLOOKUP(K17,Start!$F$18:$G$21,2,FALSE),0)","v":0},{"$f":"IFERROR(VLOOKUP(N17,Start!$H$18:$I$21,2,FALSE),0)","v":0},{"$f":"IFERROR(VLOOKUP(Q17,Start!$D$18:$E$21,2,FALSE),0)","v":0},{"$f":"IFERROR(VLOOKUP(P17,Start!$F$18:$G$21,2,FALSE),0)","v":0},{"$f":"IFERROR(VLOOKUP(R17,Start!$H$18:$I$21,2,FALSE),0)","v":0},null,null,null,null,null,{"$f":"VLOOKUP(C17,Start!$C$4:$G$7,MATCH(D17,Start!$D$3:$G$3,0)+1,FALSE)","v":{"$error":"#N/A"}},null,null,null,{"$f":"VLOOKUP(F17,Start!$C$4:$G$7,MATCH(G17,Start!$D$3:$G$3,0)+1,FALSE)","v":{"$error":"#N/A"}}]
[{"$f":"\"R\"&B18","v":"R16"},16,{"$f":"IFERROR(VLOOKUP(L18,Start!$D$18:$E$21,2,FALSE),0)","v":0},{"$f":"IFERROR(VLOOKUP(K18,Start!$F$18:$G$21,2,FALSE),0)","v":0},{"$f":"IFERROR(VLOOKUP(N18,Start!$H$18:$I$21,2,FALSE),0)","v":0},{"$f":"IFERROR(VLOOKUP(Q18,Start!$D$18:$E$21,2,FALSE),0)","v":0},{"$f":"IFERROR(VLOOKUP(P18,Start!$F$18:$G$21,2,FALSE),0)","v":0},{"$f":"IFERROR(VLOOKUP(R18,Start!$H$18:$I$21,2,FALSE),0)","v":0},null,null,null,null,null,{"$f":"VLOOKUP(C18,Start!$C$4:$G$7,MATCH(D18,Start!$D$3:$G$3,0)+1,FALSE)","v":{"$error":"#N/A"}},null,null,null,{"$f":"VLOOKUP(F18,Start!$C$4:$G$7,MATCH(G18,Start!$D$3:$G$3,0)+1,FALSE)","v":{"$error":"#N/A"}}]
[{"$f":"\"R\"&B19","v":"R17"},17,{"$f":"IFERROR(VLOOKUP(L19,Start!$D$18:$E$21,2,FALSE),0)","v":0},{"$f":"IFERROR(VLOOKUP(K19,Start!$F$18:$G$21,2,FALSE),0)","v":0},{"$f":"IFERROR(VLOOKUP(N19,Start!$H$18:$I$21,2,FALSE),0)","v":0},{"$f":"IFERROR(VLOOKUP(Q19,Start!$D$18:$E$21,2,FALSE),0)","v":0},{"$f":"IFERROR(VLOOKUP(P19,Start!$F$18:$G$21,2,FALSE),0)","v":0},{"$f":"IFERROR(VLOOKUP(R19,Start!$H$18:$I$21,2,FALSE),0)","v":0},null,null,null,null,null,{"$f":"VLOOKUP(C19,Start!$C$4:$G$7,MATCH(D19,Start!$D$3:$G$3,0)+1,FALSE)","v":{"$error":"#N/A"}},null,null,null,{"$f":"VLOOKUP(F19,Start!$C$4:$G$7,MATCH(G19,Start!$D$3:$G$3,0)+1,FALSE)","v":{"$error":"#N/A"}}]
[{"$f":"\"R\"&B20","v":"R18"},18,{"$f":"IFERROR(VLOOKUP(L20,Start!$D$18:$E$21,2,FALSE),0)","v":0},{"$f":"IFERROR(VLOOKUP(K20,Start!$F$18:$G$21,2,FALSE),0)","v":0},{"$f":"IFERROR(VLOOKUP(N20,Start!$H$18:$I$21,2,FALSE),0)","v":0},{"$f":"IFERROR(VLOOKUP(Q20,Start!$D$18:$E$21,2,FALSE),0)","v":0},{"$f":"IFERROR(VLOOKUP(P20,Start!$F$18:$G$21,2,FALSE),0)","v":0},{"$f":"IFERROR(VLOOKUP(R20,Start!$H$18:$I$21,2,FALSE),0)","v":0},null,null,null,null,null,{"$f":"VLOOKUP(C20,Start!$C$4:$G$7,MATCH(D20,Start!$D$3:$G$3,0)+1,FALSE)","v":{"$error":"#N/A"}},null,null,null,{"$f":"VLOOKUP(F20,Start!$C$4:$G$7,MATCH(G20,Start!$D$3:$G$3,0)+1,FALSE)","v":{"$error":"#N/A"}}]
[{"$f":"\"R\"&B21","v":"R19"},19,{"$f":"IFERROR(VLOOKUP(L21,Start!$D$18:$E$21,2,FALSE),0)","v":0},{"$f":"IFERROR(VLOOKUP(K21,Start!$F$18:$G$21,2,FALSE),0)","v":0},{"$f":"IFERROR(VLOOKUP(N21,Start!$H$18:$I$21,2,FALSE),0)","v":0},{"$f":"IFERROR(VLOOKUP(Q21,Start!$D$18:$E$21,2,FALSE),0)","v":0},{"$f":"IFERROR(VLOOKUP(P21,Start!$F$18:$G$21,2,FALSE),0)","v":0},{"$f":"IFERROR(VLOOKUP(R21,Start!$H$18:$I$21,2,FALSE),0)","v":0},null,null,null,null,null,{"$f":"VLOOKUP(C21,Start!$C$4:$G$7,MATCH(D21,Start!$D$3:$G$3,0)+1,FALSE)","v":{"$error":"#N/A"}},null,null,null,{"$f":"VLOOKUP(F21,Start!$C$4:$G$7,MATCH(G21,Start!$D$3:$G$3,0)+1,FALSE)","v":{"$error":"#N/A"}}]
[{"$f":"\"R\"&B22","v":"R20"},20,{"$f":"IFERROR(VLOOKUP(L22,Start!$D$18:$E$21,2,FALSE),0)","v":0},{"$f":"IFERROR(VLOOKUP(K22,Start!$F$18:$G$21,2,FALSE),0)","v":0},{"$f":"IFERROR(VLOOKUP(N22,Start!$H$18:$I$21,2,FALSE),0)","v":0},{"$f":"IFERROR(VLOOKUP(Q22,Start!$D$18:$E$21,2,FALSE),0)","v":0},{"$f":"IFERROR(VLOOKUP(P22,Start!$F$18:$G$21,2,FALSE),0)","v":0},{"$f":"IFERROR(VLOOKUP(R22,Start!$H$18:$I$21,2,FALSE),0)","v":0},null,null,null,null,null,{"$f":"VLOOKUP(C22,Start!$C$4:$G$7,MATCH(D22,Start!$D$3:$G$3,0)+1,FALSE)","v":{"$error":"#N/A"}},null,null,null,{"$f":"VLOOKUP(F22,Start!$C$4:$G$7,MATCH(G22,Start!$D$3:$G$3,0)+1,FALSE)","v":{"$error":"#N/A"}}]
[{"$f":"\"R\"&B23","v":"R21"},21,{"$f":"IFERROR(VLOOKUP(L23,Start!$D$18:$E$21,2,FALSE),0)","v":0},{"$f":"IFERROR(VLOOKUP(K23,Start!$F$18:$G$21,2,FALSE),0)","v":0},{"$f":"IFERROR(VLOOKUP(N23,Start!$H$18:$I$21,2,FALSE),0)","v":0},{"$f":"IFERROR(VLOOKUP(Q23,Start!$D$18:$E$21,2,FALSE),0)","v":0},{"$f":"IFERROR(VLOOKUP(P23,Start!$F$18:$G$21,2,FALSE),0)","v":0},{"$f":"IFERROR(VLOOKUP(R23,Start!$H$18:$I$21,2,FALSE),0)","v":0},null,null,null,null,null,{"$f":"VLOOKUP(C23,Start!$C$4:$G$7,MATCH(D23,Start!$D$3:$G$3,0)+1,FALSE)","v":{"$error":"#N/A"}},null,null,null,{"$f":"VLOOKUP(F23,Start!$C$4:$G$7,MATCH(G23,Start!$D$3:$G$3,0)+1,FALSE)","v":{"$error":"#N/A"}}]
[{"$f":"\"R\"&B24","v":"R22"},22,{"$f":"IFERROR(VLOOKUP(L24,Start!$D$18:$E$21,2,FALSE),0)","v":0},{"$f":"IFERROR(VLOOKUP(K24,Start!$F$18:$G$21,2,FALSE),0)","v":0},{"$f":"IFERROR(VLOOKUP(N24,Start!$H$18:$I$21,2,FALSE),0)","v":0},{"$f":"IFERROR(VLOOKUP(Q24,Start!$D$18:$E$21,2,FALSE),0)","v":0},{"$f":"IFERROR(VLOOKUP(P24,Start!$F$18:$G$21,2,FALSE),0)","v":0},{"$f":"IFERROR(VLOOKUP(R24,Start!$H$18:$I$21,2,FALSE),0)","v":0},null,null,null,null,null,{"$f":"VLOOKUP(C24,Start!$C$4:$G$7,MATCH(D24,Start!$D$3:$G$3,0)+1,FALSE)","v":{"$error":"#N/A"}},null,null,null,{"$f":"VLOOKUP(F24,Start!$C$4:$G$7,MATCH(G24,Start!$D$3:$G$3,0)+1,FALSE)","v":{"$error":"#N/A"}}]
[{"$f":"\"R\"&B25","v":"R23"},23,{"$f":"IFERROR(VLOOKUP(L25,Start!$D$18:$E$21,2,FALSE),0)","v":0},{"$f":"IFERROR(VLOOKUP(K25,Start!$F$18:$G$21,2,FALSE),0)","v":0},{"$f":"IFERROR(VLOOKUP(N25,Start!$H$18:$I$21,2,FALSE),0)","v":0},{"$f":"IFERROR(VLOOKUP(Q25,Start!$D$18:$E$21,2,FALSE),0)","v":0},{"$f":"IFERROR(VLOOKUP(P25,Start!$F$18:$G$21,2,FALSE),0)","v":0},{"$f":"IFERROR(VLOOKUP(R25,Start!$H$18:$I$21,2,FALSE),0)","v":0},null,null,null,null,null,{"$f":"VLOOKUP(C25,Start!$C$4:$G$7,MATCH(D25,Start!$D$3:$G$3,0)+1,FALSE)","v":{"$error":"#N/A"}},null,null,null,{"$f":"VLOOKUP(F25,Start!$C$4:$G$7,MATCH(G25,Start!$D$3:$G$3,0)+1,FALSE)","v":{"$error":"#N/A"}}]
[{"$f":"\"R\"&B26","v":"R24"},24,{"$f":"IFERROR(VLOOKUP(L26,Start!$D$18:$E$21,2,FALSE),0)","v":0},{"$f":"IFERROR(VLOOKUP(K26,Start!$F$18:$G$21,2,FALSE),0)","v":0},{"$f":"IFERROR(VLOOKUP(N26,Start!$H$18:$I$21,2,FALSE),0)","v":0},{"$f":"IFERROR(VLOOKUP(Q26,Start!$D$18:$E$21,2,FALSE),0)","v":0},{"$f":"IFERROR(VLOOKUP(P26,Start!$F$18:$G$21,2,FALSE),0)","v":0},{"$f":"IFERROR(VLOOKUP(R26,Start!$H$18:$I$21,2,FALSE),0)","v":0},null,null,null,null,null,{"$f":"VLOOKUP(C26,Start!$C$4:$G$7,MATCH(D26,Start!$D$3:$G$3,0)+1,FALSE)","v":{"$error":"#N/A"}},null,null,null,{"$f":"VLOOKUP(F26,Start!$C$4:$G$7,MATCH(G26,Start!$D$3:$G$3,0)+1,FALSE)","v":{"$error":"#N/A"}}]
[{"$f":"\"R\"&B27","v":"R25"},25,{"$f":"IFERROR(VLOOKUP(L27,Start!$D$18:$E$21,2,FALSE),0)","v":0},{"$f":"IFERROR(VLOOKUP(K27,Start!$F$18:$G$21,2,FALSE),0)","v":0},{"$f":"IFERROR(VLOOKUP(N27,Start!$H$18:$I$21,2,FALSE),0)","v":0},{"$f":"IFERROR(VLOOKUP(Q27,Start!$D$18:$E$21,2,FALSE),0)","v":0},{"$f":"IFERROR(VLOOKUP(P27,Start!$F$18:$G$21,2,FALSE),0)","v":0},{"$f":"IFERROR(VLOOKUP(R27,Start!$H$18:$I$21,2,FALSE),0)","v":0},null,null,null,null,null,{"$f":"VLOOKUP(C27,Start!$C$4:$G$7,MATCH(D27,Start!$D$3:$G$3,0)+1,FALSE)","v":{"$error":"#N/A"}},null,null,null,{"$f":"VLOOKUP(F27,Start!$C$4:$G$7,MATCH(G27,Start!$D$3:$G$3,0)+1,FALSE)","v":{"$error":"#N/A"}}]
[{"$f":"\"R\"&B28","v":"R26"},26,{"$f":"IFERROR(VLOOKUP(L28,Start!$D$18:$E$21,2,FALSE),0)","v":0},{"$f":"IFERROR(VLOOKUP(K28,Start!$F$18:$G$21,2,FALSE),0)","v":0},{"$f":"IFERROR(VLOOKUP(N28,Start!$H$18:$I$21,2,FALSE),0)","v":0},{"$f":"IFERROR(VLOOKUP(Q28,Start!$D$18:$E$21,2,FALSE),0)","v":0},{"$f":"IFERROR(VLOOKUP(P28,Start!$F$18:$G$21,2,FALSE),0)","v":0},{"$f":"IFERROR(VLOOKUP(R28,Start!$H$18:$I$21,2,FALSE),0)","v":0},null,null,null,null,null,{"$f":"VLOOKUP(C28,Start!$C$4:$G$7,MATCH(D28,Start!$D$3:$G$3,0)+1,FALSE)","v":{"$error":"#N/A"}},null,null,null,{"$f":"VLOOKUP(F28,Start!$C$4:$G$7,MATCH(G28,Start!$D$3:$G$3,0)+1,FALSE)","v":{"$error":"#N/A"}}]
[{"$f":"\"R\"&B29","v":"R27"},27,{"$f":"IFERROR(VLOOKUP(L29,Start!$D$18:$E$21,2,FALSE),0)","v":0},{"$f":"IFERROR(VLOOKUP(K29,Start!$F$18:$G$21,2,FALSE),0)","v":0},{"$f":"IFERROR(VLOOKUP(N29,Start!$H$18:$I$21,2,FALSE),0)","v":0},{"$f":"IFERROR(VLOOKUP(Q29,Start!$D$18:$E$21,2,FALSE),0)","v":0},{"$f":"IFERROR(VLOOKUP(P29,Start!$F$18:$G$21,2,FALSE),0)","v":0},{"$f":"IFERROR(VLOOKUP(R29,Start!$H$18:$I$21,2,FALSE),0)","v":0},null,null,null,null,null,{"$f":"VLOOKUP(C29,Start!$C$4:$G$7,MATCH(D29,Start!$D$3:$G$3,0)+1,FALSE)","v":{"$error":"#N/A"}},null,null,null,{"$f":"VLOOKUP(F29,Start!$C$4:$G$7,MATCH(G29,Start!$D$3:$G$3,0)+1,FALSE)","v":{"$error":"#N/A"}}]
[{"$f":"\"R\"&B30","v":"R28"},28,{"$f":"IFERROR(VLOOKUP(L30,Start!$D$18:$E$21,2,FALSE),0)","v":0},{"$f":"IFERROR(VLOOKUP(K30,Start!$F$18:$G$21,2,FALSE),0)","v":0},{"$f":"IFERROR(VLOOKUP(N30,Start!$H$18:$I$21,2,FALSE),0)","v":0},{"$f":"IFERROR(VLOOKUP(Q30,Start!$D$18:$E$21,2,FALSE),0)","v":0},{"$f":"IFERROR(VLOOKUP(P30,Start!$F$18:$G$21,2,FALSE),0)","v":0},{"$f":"IFERROR(VLOOKUP(R30,Start!$H$18:$I$21,2,FALSE),0)","v":0},null,null,null,null,null,{"$f":"VLOOKUP(C30,Start!$C$4:$G$7,MATCH(D30,Start!$D$3:$G$3,0)+1,FALSE)","v":{"$error":"#N/A"}},null,null,null,{"$f":"VLOOKUP(F30,Start!$C$4:$G$7,MATCH(G30,Start!$D$3:$G$3,0)+1,FALSE)","v":{"$error":"#N/A"}}]
{"$rows_left_out":73}
{"sheet":"Matrise","index":2,"n_rows":18,"n_cols":7,"rows_kept":18,"cut":false,"hidden":true,"merged":[]}
[]
[null,null,null,"Risiko før tiltak"]
[null,null,null,1,2,3,4]
[null,{"$f":"Start!$D$21","v":"Svært høy"},4,{"$f":"ProbSevScore($C4,$D$3,Risikovurdering!$A$3:$A$102)","v":""},{"$f":"ProbSevScore($C4,$E$3,Risikovurdering!$A$3:$A$102)","v":""},{"$f":"ProbSevScore($C4,$F$3,Risikovurdering!$A$3:$A$102)","v":"R1"},{"$f":"ProbSevScore($C4,$G$3,Risikovurdering!$A$3:$A$102)","v":""}]
[null,{"$f":"Start!$D$20","v":"Høy"},3,{"$f":"ProbSevScore($C5,$D$3,Risikovurdering!$A$3:$A$102)","v":""},{"$f":"ProbSevScore($C5,$E$3,Risikovurdering!$A$3:$A$102)","v":""},{"$f":"ProbSevScore($C5,$F$3,Risikovurdering!$A$3:$A$102)","v":""},{"$f":"ProbSevScore($C5,$G$3,Risikovurdering!$A$3:$A$102)","v":""}]
[null,{"$f":"Start!$D$19","v":"Moderat"},2,{"$f":"ProbSevScore($C6,$D$3,Risikovurdering!$A$3:$A$102)","v":""},{"$f":"ProbSevScore($C6,$E$3,Risikovurdering!$A$3:$A$102)","v":""},{"$f":"ProbSevScore($C6,$F$3,Risikovurdering!$A$3:$A$102)","v":""},{"$f":"ProbSevScore($C6,$G$3,Risikovurdering!$A$3:$A$102)","v":""}]
[null,{"$f":"Start!$D$18","v":"Lav"},1,{"$f":"ProbSevScore($C7,$D$3,Risikovurdering!$A$3:$A$102)","v":""},{"$f":"ProbSevScore($C7,$E$3,Risikovurdering!$A$3:$A$102)","v":""},{"$f":"ProbSevScore($C7,$F$3,Risikovurdering!$A$3:$A$102)","v":""},{"$f":"ProbSevScore($C7,$G$3,Risikovurdering!$A$3:$A$102)","v":""}]
[null,null,null,{"$f":"Start!$F$18","v":"Lav"},{"$f":"Start!$F$19","v":"Moderat"},{"$f":"Start!$F$20","v":"Høy"},{"$f":"Start!$F$21","v":"Svært høy"}]
[]
[]
[]
[null,null,null,"Gjenværende risiko"]
[null,null,null,1,2,3,4]
[null,{"$f":"Start!D$21","v":"Svært høy"},4,{"$f":"ProbSevScore2($C14,$D$13,Risikovurdering!$A$3:$A$102)","v":""},{"$f":"ProbSevScore2($C14,$E$13,Risikovurdering!$A$3:$A$102)","v":""},{"$f":"ProbSevScore2($C14,$F$13,Risikovurdering!$A$3:$A$102)","v":""},{"$f":"ProbSevScore2($C14,$G$13,Risikovurdering!$A$3:$A$102)","v":""}]
[null,{"$f":"Start!$D$20","v":"Høy"},3,{"$f":"ProbSevScore2($C15,$D$13,Risikovurdering!$A$3:$A$102)","v":""},{"$f":"ProbSevScore2($C15,$E$13,Risikovurdering!$A$3:$A$102)","v":""},{"$f":"ProbSevScore2($C15,$F$13,Risikovurdering!$A$3:$A$102)","v":""},{"$f":"ProbSevScore2($C15,$G$13,Risikovurdering!$A$3:$A$102)","v":""}]
[null,{"$f":"Start!$D$19","v":"Moderat"},2,{"$f":"ProbSevScore2($C16,$D$13,Risikovurdering!$A$3:$A$102)","v":""},{"$f":"ProbSevScore2($C16,$E$13,Risikovurdering!$A$3:$A$102)","v":"R1"},{"$f":"ProbSevScore2($C16,$F$13,Risikovurdering!$A$3:$A$102)","v":""},{"$f":"ProbSevScore2($C16,$G$13,Risikovurdering!$A$3:$A$102)","v":""}]
[null,{"$f":"Start!$D$18","v":"Lav"},1,{"$f":"ProbSevScore2($C17,$D$13,Risikovurdering!$A$3:$A$102)","v":""},{"$f":"ProbSevScore2($C17,$E$13,Risikovurdering!$A$3:$A$102)","v":""},{"$f":"ProbSevScore2($C17,$F$13,Risikovurdering!$A$3:$A$102)","v":""},{"$f":"ProbSevScore2($C17,$G$13,Risikovurdering!$A$3:$A$102)","v":""}]
[null,null,null,{"$f":"Start!$F$18","v":"Lav"},{"$f":"Start!$F$19","v":"Moderat"},{"$f":"Start!$F$20","v":"Høy"},{"$f":"Start!$F$21","v":"Svært høy"}]